Страница 1 из 11
Модератор форума: Dimitro 
Форум » TrinityCore » [TrinityCore] Help » Ошибка при компиляции(Ubuntu 14.04)
Ошибка при компиляции(Ubuntu 14.04)
Gliptodont
Сержант
Сделал все как сказано в тут.
Все вроде бы отлично, но когда дело дошло до конфигурации выстветилось следующее:

Код
Detected 64-bit platform
-- UNIX: Using jemalloc
-- UNIX: Configuring uninstall target
-- UNIX: Created uninstall target
-- UNIX: Detected compiler: /usr/bin/cc
-- Using mysql-config: /usr/bin/mysql_config
-- Found MySQL library: /usr/lib/x86_64-linux-gnu/libmysqlclient_r.so
-- Found MySQL headers: /usr/include/mysql
-- Found Readline library: /usr/lib/x86_64-linux-gnu/libreadline.so
-- Include dir is: /usr/include
-- WARNING - Missing repository tags - you may need to pull tags with git fetch -t
-- WARNING - Continuing anyway - note that the versionstring will be set to 0000-00-00 00:00:00 (Archived)

* TrinityCore rev. hash  : Archived
* TrinityCore rev. date  : 0000-00-00 00:00:00 +0000
* TrinityCore buildtype  : Release

* Install core to        : /home/trinity/release
* Install libraries to   : /home/Diyvol/server/lib
* Install configs to     : /home/Diyvol/server/etc

* Build world/auth       : Yes (default)
* Build with scripts     : Yes (default)
* Build map/vmap tools   : Yes
* Build core w/PCH       : Yes (default)
* Build scripts w/PCH    : Yes (default)
* Show all warnings      : Yes
* Use coreside debug     : No  (default)

-- SCRIPT PREPARATIONS
  -> Prepared: Spells
  -> Prepared: Commands
  -> Prepared: Examples
  -> Prepared: Custom
  -> Prepared: World
  -> Prepared: Outdoor PVP Zones
  -> Prepared: Eastern Kingdoms
  -> Prepared: Kalimdor
  -> Prepared: The Maelstrom
  -> Prepared: Outland
  -> Prepared: Northrend
  -> Prepared: Events
-- SCRIPT PREPARATION COMPLETE

CMake Error: The following variables are used in this project, but they are set to NOTFOUND.
Please set them or make sure they are set and tested correctly in the CMake files:
ACE_INCLUDE_DIR (ADVANCED)
   used as include directory in directory /home/chaklun/TrinityCore/src/server/shared
   used as include directory in directory /home/chaklun/TrinityCore/src/server/shared
   used as include directory in directory /home/chaklun/TrinityCore/src/server/shared
   used as include directory in directory /home/chaklun/TrinityCore/src/server/game
   used as include directory in directory /home/chaklun/TrinityCore/src/server/game
   used as include directory in directory /home/chaklun/TrinityCore/src/server/game
   used as include directory in directory /home/chaklun/TrinityCore/src/server/collision
   used as include directory in directory /home/chaklun/TrinityCore/src/server/collision
   used as include directory in directory /home/chaklun/TrinityCore/src/server/collision
   used as include directory in directory /home/chaklun/TrinityCore/src/server/authserver
   used as include directory in directory /home/chaklun/TrinityCore/src/server/authserver
   used as include directory in directory /home/chaklun/TrinityCore/src/server/authserver
   used as include directory in directory /home/chaklun/TrinityCore/src/server/scripts
   used as include directory in directory /home/chaklun/TrinityCore/src/server/scripts
   used as include directory in directory /home/chaklun/TrinityCore/src/server/scripts
   used as include directory in directory /home/chaklun/TrinityCore/src/server/worldserver
   used as include directory in directory /home/chaklun/TrinityCore/src/server/worldserver
   used as include directory in directory /home/chaklun/TrinityCore/src/server/worldserver
   used as include directory in directory /home/chaklun/TrinityCore/src/tools/vmap4_assembler
   used as include directory in directory /home/chaklun/TrinityCore/src/tools/mmaps_generator
ACE_LIBRARY (ADVANCED)
    linked by target "shared" in directory /home/chaklun/TrinityCore/src/server/shared
    linked by target "authserver" in directory /home/chaklun/TrinityCore/src/server/authserver
    linked by target "worldserver" in directory /home/chaklun/TrinityCore/src/server/worldserver
    linked by target "mmaps_generator" in directory /home/chaklun/TrinityCore/src/tools/mmaps_generator

-- Configuring incomplete, errors occurred!
See also "/home/chaklun/TrinityCore/build/CMakeFiles/CMakeOutput.log".
See also "/home/chaklun/TrinityCore/build/CMakeFiles/CMakeError.log".


Что нужно сделать, чтобы оно заработало? Исходники брал тут
Да прибудет с нами Сила!
Сообщение # 1 написано 24.08.2017 в 19:53
dowland
Сержант
Попробуй установить ACE по другому.

Код
apt-get update && apt-get install libace-6.* libace-dev


Да и мануал какой-то сложный о.о
У меня всё как-то гораздо проще...
Если не получится попробуй сделать как я:
1.

Код
apt-get update && apt-get install build-essential autoconf libtool gcc g++ make cmake git-core p7zip-full libncurses5-dev openssl libssl-dev mysql-client libmysqlclient15-dev libmysql++-dev libreadline6-dev zlib1g-dev libbz2-dev libzmq-dev zip unzip libace-6.* libace-dev

2. Зайди в папку build
3.

Код
cmake ../ -DCMAKE_INSTALL_PREFIX=/home/test/server/


Ну и всё, смотри что получится, если что пиши ошибки, дальше будем смотреть biggrin

--
Попробовал у себя сделать, та же ОС

Код
root@ns3365105:~/WoWSource434/build# cmake ../ -DCMAKE_INSTALL_PREFIX=/home/test/server/
-- Detected 64-bit platform
-- UNIX: Using jemalloc
-- UNIX: Using default configuration directory
-- UNIX: Using default library directory
-- UNIX: Configuring uninstall target
-- UNIX: Created uninstall target
-- UNIX: Detected compiler: /usr/bin/cc
-- Found ACE library: /usr/lib/libACE.so
-- Found ACE headers: /usr/include
-- Using mysql-config: /usr/bin/mysql_config
-- Found MySQL library: /usr/lib/x86_64-linux-gnu/libmysqlclient_r.so
-- Found MySQL headers: /usr/include/mysql
-- Found Readline library: /usr/lib/x86_64-linux-gnu/libreadline.so
-- Include dir is: /usr/include
-- WARNING - Missing repository tags - you may need to pull tags with git fetch -t
-- WARNING - Continuing anyway - note that the versionstring will be set to 0000-00-00 00:00:00 (Archived)

* TrinityCore rev. hash  : Archived
* TrinityCore rev. date  : 0000-00-00 00:00:00 +0000
* TrinityCore buildtype  : Release

* Install core to        : /home/test/server
* Install libraries to   : /home/test/server/lib
* Install configs to     : /home/test/server/etc

* Build world/auth       : Yes (default)
* Build with scripts     : Yes (default)
* Build map/vmap tools   : No  (default)
* Build core w/PCH       : Yes (default)
* Build scripts w/PCH    : Yes (default)
* Show compile-warnings  : No  (default)
* Use coreside debug     : No  (default)

-- SCRIPT PREPARATIONS
  -> Prepared: Spells
  -> Prepared: Commands
  -> Prepared: Examples
  -> Prepared: Custom
  -> Prepared: World
  -> Prepared: Outdoor PVP Zones
  -> Prepared: Eastern Kingdoms
  -> Prepared: Kalimdor
  -> Prepared: The Maelstrom
  -> Prepared: Outland
  -> Prepared: Northrend
  -> Prepared: Events
-- SCRIPT PREPARATION COMPLETE

-- Configuring done
-- Generating done
-- Build files have been written to: /root/WoWSource434/build
Сообщение # 2 отредактировано dowland - Воскресенье, 27.08.2017, 09:44
Gliptodont
Сержант
Цитата dowland ()
Попробуй установить ACE по другому.Код
apt-get update && apt-get install libace-6.* libace-dev

Да и мануал какой-то сложный о.о
У меня всё как-то гораздо проще...
Если не получится попробуй сделать как я:
1.

Код
apt-get update && apt-get install build-essential autoconf libtool gcc g++ make cmake git-core p7zip-full libncurses5-dev openssl libssl-dev mysql-client libmysqlclient15-dev libmysql++-dev libreadline6-dev zlib1g-dev libbz2-dev libzmq-dev zip unzip libace-6.* libace-dev

2. Зайди в папку build
3.

Код
cmake ../ -DCMAKE_INSTALL_PREFIX=/home/test/server/

Ну и всё, смотри что получится, если что пиши ошибки, дальше будем смотреть

--
Попробовал у себя сделать, та же ОС

Код
root@ns3365105:~/WoWSource434/build# cmake ../ -DCMAKE_INSTALL_PREFIX=/home/test/server/
-- Detected 64-bit platform
-- UNIX: Using jemalloc
-- UNIX: Using default configuration directory
-- UNIX: Using default library directory
-- UNIX: Configuring uninstall target
-- UNIX: Created uninstall target
-- UNIX: Detected compiler: /usr/bin/cc
-- Found ACE library: /usr/lib/libACE.so
-- Found ACE headers: /usr/include
-- Using mysql-config: /usr/bin/mysql_config
-- Found MySQL library: /usr/lib/x86_64-linux-gnu/libmysqlclient_r.so
-- Found MySQL headers: /usr/include/mysql
-- Found Readline library: /usr/lib/x86_64-linux-gnu/libreadline.so
-- Include dir is: /usr/include
-- WARNING - Missing repository tags - you may need to pull tags with git fetch -t
-- WARNING - Continuing anyway - note that the versionstring will be set to 0000-00-00 00:00:00 (Archived)

* TrinityCore rev. hash  : Archived
* TrinityCore rev. date  : 0000-00-00 00:00:00 +0000
* TrinityCore buildtype  : Release

* Install core to        : /home/test/server
* Install libraries to   : /home/test/server/lib
* Install configs to     : /home/test/server/etc

* Build world/auth       : Yes (default)
* Build with scripts     : Yes (default)
* Build map/vmap tools   : No  (default)
* Build core w/PCH       : Yes (default)
* Build scripts w/PCH    : Yes (default)
* Show compile-warnings  : No  (default)
* Use coreside debug     : No  (default)

-- SCRIPT PREPARATIONS
Не получалось даже так, только с получением root прав пошло дело. Но все равно огромное спасибо за ответ. 
Увы опять пошла проблема после cmake, когда применял make -j n, идет процесс, но местами бывает останавливается, после второго применения опять пошло дело, но потом останавливается и ошибка вечная.
Да прибудет с нами Сила!
Сообщение # 3 написано 27.08.2017 в 14:08
dowland
Сержант
Цитата Gliptodont ()
Не получалось даже так
Весьма странно, попробуй просто make комманду, без -j и покажи какие ошибки.
Сообщение # 4 написано 27.08.2017 в 16:37
Gliptodont
Сержант
Код
Scanning dependencies of target jemalloc
[  0%] Building C object dep/jemalloc/CMakeFiles/jemalloc.dir/src/arena.c.o
In file included from /home/WoWSource434/dep/jemalloc/include/jemalloc/internal/jemalloc_internal.h:568:0,
                 from /home/WoWSource434/dep/jemalloc/src/arena.c:2:
/home/WoWSource434/dep/jemalloc/include/jemalloc/internal/util.h:88:49: error: expected ‘;’, ‘,’ or ‘)’ before ‘nptr’
 uintmax_t malloc_strtoumax(const char *restrict nptr,
                    ^
make[2]: *** [dep/jemalloc/CMakeFiles/jemalloc.dir/src/arena.c.o] Ошибка 1
make[1]: *** [dep/jemalloc/CMakeFiles/jemalloc.dir/all] Ошибка 2
make: ***  [all]Ошибка 2

Это просто - make

Код
Scanning dependencies of target Detour
Scanning dependencies of target Recast
Scanning dependencies of target g3dlib
Scanning dependencies of target revision.h
Scanning dependencies of target gamePCH.cpp_dephelp
Scanning dependencies of target gsoap
Scanning dependencies of target sharedPCH.cpp_dephelp
Scanning dependencies of target collisionPCH.cpp_dephelp
Scanning dependencies of target authPCH.cpp_dephelp
Scanning dependencies of target worldPCH.cpp_dephelp
Scanning dependencies of target ScriptPCH.cpp_dephelp
[  0%] [  0%] [  0%] -- WARNING - Missing repository tags - you may need to pull tags with git fetch -t
-- WARNING - Continuing anyway - note that the versionstring will be set to 0000-00-00 00:00:00 (Archived)
[  0%] Building C object dep/jemalloc/CMakeFiles/jemalloc.dir/src/arena.c.o
Building C object dep/jemalloc/CMakeFiles/jemalloc.dir/src/atomic.c.o
Building C object dep/jemalloc/CMakeFiles/jemalloc.dir/src/base.c.o
[  0%] Building C object dep/jemalloc/CMakeFiles/jemalloc.dir/src/bitmap.c.o
Built target revision.h
[  0%] Building C object dep/jemalloc/CMakeFiles/jemalloc.dir/src/chunk.c.o
In file included from /home/WoWSource434/dep/jemalloc/include/jemalloc/internal/jemalloc_internal.h:568:0,
                 from /home/WoWSource434/dep/jemalloc/src/atomic.c:2:
/home/WoWSource434/dep/jemalloc/include/jemalloc/internal/util.h:88:49: error: expected ‘;’, ‘,’ or ‘)’ before ‘nptr’
uintmax_t malloc_strtoumax(const char *restrict nptr,
                    ^
In file included from /home/WoWSource434/dep/jemalloc/include/jemalloc/internal/jemalloc_internal.h:568:0,
                 from /home/WoWSource434/dep/jemalloc/src/arena.c:2:
/home/WoWSource434/dep/jemalloc/include/jemalloc/internal/util.h:88:49: error: expected ‘;’, ‘,’ or ‘)’ before ‘nptr’
uintmax_t malloc_strtoumax(const char *restrict nptr,
                    ^
In file included from /home/WoWSource434/dep/jemalloc/include/jemalloc/internal/jemalloc_internal.h:568:0,
                 from /home/WoWSource434/dep/jemalloc/src/chunk.c:2:
/home/WoWSource434/dep/jemalloc/include/jemalloc/internal/util.h:88:49: error: expected ‘;’, ‘,’ or ‘)’ before ‘nptr’
uintmax_t malloc_strtoumax(const char *restrict nptr,
                    ^
In file included from /home/WoWSource434/dep/jemalloc/include/jemalloc/internal/jemalloc_internal.h:568:0,
                 from /home/WoWSource434/dep/jemalloc/src/bitmap.c:2:
/home/WoWSource434/dep/jemalloc/include/jemalloc/internal/util.h:88:49: error: expected ‘;’, ‘,’ or ‘)’ before ‘nptr’
uintmax_t malloc_strtoumax(const char *restrict nptr,
                    ^
In file included from /home/WoWSource434/dep/jemalloc/include/jemalloc/internal/jemalloc_internal.h:568:0,
                 from /home/WoWSource434/dep/jemalloc/src/base.c:2:
/home/WoWSource434/dep/jemalloc/include/jemalloc/internal/util.h:88:49: error: expected ‘;’, ‘,’ or ‘)’ before ‘nptr’
uintmax_t malloc_strtoumax(const char *restrict nptr,
                    ^
make[2]: *** [dep/jemalloc/CMakeFiles/jemalloc.dir/src/arena.c.o] Ошибка 1
make[2]: *** Ожидание завершения заданий…
make[2]: *** [dep/jemalloc/CMakeFiles/jemalloc.dir/src/atomic.c.o] Ошибка 1
make[2]: *** [dep/jemalloc/CMakeFiles/jemalloc.dir/src/base.c.o] Ошибка 1
make[2]: *** [dep/jemalloc/CMakeFiles/jemalloc.dir/src/bitmap.c.o] Ошибка 1
make[2]: *** [dep/jemalloc/CMakeFiles/jemalloc.dir/src/chunk.c.o] Ошибка 1
make[1]: *** [dep/jemalloc/CMakeFiles/jemalloc.dir/all] Ошибка 2
make[1]: *** Ожидание завершения заданий…
[  0%] [  0%] [  0%] [  0%] Building CXX object dep/recastnavigation/Detour/CMakeFiles/Detour.dir/DetourCommon.cpp.o
Building CXX object dep/recastnavigation/Detour/CMakeFiles/Detour.dir/DetourAlloc.cpp.o
[  0%] [  0%] Building CXX object dep/recastnavigation/Detour/CMakeFiles/Detour.dir/DetourNavMesh.cpp.o
Building CXX object dep/recastnavigation/Detour/CMakeFiles/Detour.dir/DetourNavMeshBuilder.cpp.o
Building CXX object dep/recastnavigation/Detour/CMakeFiles/Detour.dir/DetourNavMeshQuery.cpp.o
Building CXX object dep/recastnavigation/Detour/CMakeFiles/Detour.dir/DetourNode.cpp.o
[  0%] Building CXX object src/server/shared/CMakeFiles/sharedPCH.cpp_dephelp.dir/PrecompiledHeaders/sharedPCH.cpp.o
[  0%] Building CXX object src/server/authserver/CMakeFiles/authPCH.cpp_dephelp.dir/PrecompiledHeaders/authPCH.cpp.o
[  0%] Building CXX object dep/gsoap/CMakeFiles/gsoap.dir/soapC.cpp.o
[  0%] Building CXX object dep/recastnavigation/Recast/CMakeFiles/Recast.dir/Recast.cpp.o
[  0%] [  0%] Building CXX object src/server/collision/CMakeFiles/collisionPCH.cpp_dephelp.dir/PrecompiledHeaders/collisionPCH.cpp.o
Building CXX object src/server/worldserver/CMakeFiles/worldPCH.cpp_dephelp.dir/PrecompiledHeaders/worldPCH.cpp.o
[  0%] Building CXX object dep/recastnavigation/Recast/CMakeFiles/Recast.dir/RecastAlloc.cpp.o
[  0%] Building CXX object dep/recastnavigation/Recast/CMakeFiles/Recast.dir/RecastArea.cpp.o
[  0%] Building CXX object dep/recastnavigation/Recast/CMakeFiles/Recast.dir/RecastContour.cpp.o
[  0%] Building CXX object dep/g3dlite/CMakeFiles/g3dlib.dir/source/AABox.cpp.o
[  0%] Building CXX object dep/g3dlite/CMakeFiles/g3dlib.dir/source/Any.cpp.o
[  1%] Building CXX object dep/recastnavigation/Recast/CMakeFiles/Recast.dir/RecastFilter.cpp.o
[  1%] Building CXX object src/server/game/CMakeFiles/gamePCH.cpp_dephelp.dir/PrecompiledHeaders/gamePCH.cpp.o
[  1%] Building CXX object src/server/scripts/CMakeFiles/ScriptPCH.cpp_dephelp.dir/PrecompiledHeaders/ScriptPCH.cpp.o
[  1%] Building CXX object dep/recastnavigation/Recast/CMakeFiles/Recast.dir/RecastLayers.cpp.o
[  1%] Building CXX object dep/recastnavigation/Recast/CMakeFiles/Recast.dir/RecastMesh.cpp.o
[  1%] Building CXX object dep/recastnavigation/Recast/CMakeFiles/Recast.dir/RecastMeshDetail.cpp.o
[  1%] Building CXX object dep/recastnavigation/Recast/CMakeFiles/Recast.dir/RecastRasterization.cpp.o
[  2%] [  2%] Building CXX object dep/recastnavigation/Recast/CMakeFiles/Recast.dir/RecastRegion.cpp.o
Building CXX object dep/gsoap/CMakeFiles/gsoap.dir/stdsoap2.cpp.o
[  2%] Building CXX object dep/g3dlite/CMakeFiles/g3dlib.dir/source/BinaryFormat.cpp.o
[  2%] Building CXX object dep/g3dlite/CMakeFiles/g3dlib.dir/source/BinaryInput.cpp.o
Linking CXX shared module libsharedPCH.cpp_dephelp.so
[  2%] Built target sharedPCH.cpp_dephelp
[  2%] Building CXX object dep/g3dlite/CMakeFiles/g3dlib.dir/source/BinaryOutput.cpp.o
[  2%] Building CXX object dep/g3dlite/CMakeFiles/g3dlib.dir/source/Box.cpp.o
Linking CXX shared module libcollisionPCH.cpp_dephelp.so
[  2%] Built target collisionPCH.cpp_dephelp
[  3%] Building CXX object dep/g3dlite/CMakeFiles/g3dlib.dir/source/Capsule.cpp.o
Linking CXX shared module libauthPCH.cpp_dephelp.so
[  3%] Built target authPCH.cpp_dephelp
[  3%] Building CXX object dep/g3dlite/CMakeFiles/g3dlib.dir/source/CollisionDetection.cpp.o
Linking CXX static library libDetour.a
[  3%] Built target Detour
[  3%] Building CXX object dep/gsoap/CMakeFiles/gsoap.dir/soapServer.cpp.o
[  3%] Building CXX object dep/g3dlite/CMakeFiles/g3dlib.dir/source/CoordinateFrame.cpp.o
[  3%] [  3%] Linking CXX shared module libworldPCH.cpp_dephelp.so
[  3%] Building CXX object dep/g3dlite/CMakeFiles/g3dlib.dir/source/Crypto.cpp.o
Building CXX object dep/g3dlite/CMakeFiles/g3dlib.dir/source/Cylinder.cpp.o
Building CXX object dep/g3dlite/CMakeFiles/g3dlib.dir/source/debugAssert.cpp.o
[  3%] Building CXX object dep/g3dlite/CMakeFiles/g3dlib.dir/source/FileSystem.cpp.o
[  3%] [  3%] Built target worldPCH.cpp_dephelp
Building CXX object dep/g3dlite/CMakeFiles/g3dlib.dir/source/fileutils.cpp.o
[  3%] Building CXX object dep/g3dlite/CMakeFiles/g3dlib.dir/source/format.cpp.o
Linking CXX static library libRecast.a
[  3%] Building CXX object dep/g3dlite/CMakeFiles/g3dlib.dir/source/g3dfnmatch.cpp.o
[  3%] Built target Recast
[  3%] [  4%] Building CXX object dep/g3dlite/CMakeFiles/g3dlib.dir/source/g3dmath.cpp.o
Building CXX object dep/g3dlite/CMakeFiles/g3dlib.dir/source/Line.cpp.o
[  4%] Building CXX object dep/g3dlite/CMakeFiles/g3dlib.dir/source/LineSegment.cpp.o
[  4%] Building CXX object dep/g3dlite/CMakeFiles/g3dlib.dir/source/Log.cpp.o
[  4%] Building CXX object dep/g3dlite/CMakeFiles/g3dlib.dir/source/Matrix3.cpp.o
[  4%] Building CXX object dep/g3dlite/CMakeFiles/g3dlib.dir/source/Matrix4.cpp.o
[  4%] Building CXX object dep/g3dlite/CMakeFiles/g3dlib.dir/source/MemoryManager.cpp.o
[  4%] Building CXX object dep/g3dlite/CMakeFiles/g3dlib.dir/source/PhysicsFrame.cpp.o
[  4%] Building CXX object dep/g3dlite/CMakeFiles/g3dlib.dir/source/Plane.cpp.o
[  4%] Building CXX object dep/g3dlite/CMakeFiles/g3dlib.dir/source/prompt.cpp.o
[  4%] Building CXX object dep/g3dlite/CMakeFiles/g3dlib.dir/source/Quat.cpp.o
Linking CXX shared module libgamePCH.cpp_dephelp.so
[  4%] Building CXX object dep/g3dlite/CMakeFiles/g3dlib.dir/source/Random.cpp.o
[  4%] Built target gamePCH.cpp_dephelp
[  5%] Building CXX object dep/g3dlite/CMakeFiles/g3dlib.dir/source/Ray.cpp.o
[  5%] Building CXX object dep/g3dlite/CMakeFiles/g3dlib.dir/source/ReferenceCount.cpp.o
[  5%] Building CXX object dep/g3dlite/CMakeFiles/g3dlib.dir/source/RegistryUtil.cpp.o
[  5%] [  5%] Building CXX object dep/g3dlite/CMakeFiles/g3dlib.dir/source/Sphere.cpp.o
Building CXX object dep/g3dlite/CMakeFiles/g3dlib.dir/source/stringutils.cpp.o
[  5%] Building CXX object dep/g3dlite/CMakeFiles/g3dlib.dir/source/System.cpp.o
[  5%] Building CXX object dep/g3dlite/CMakeFiles/g3dlib.dir/source/TextInput.cpp.o
[  5%] Building CXX object dep/g3dlite/CMakeFiles/g3dlib.dir/source/TextOutput.cpp.o
[  5%] Building CXX object dep/g3dlite/CMakeFiles/g3dlib.dir/source/Triangle.cpp.o
[  5%] Building CXX object dep/g3dlite/CMakeFiles/g3dlib.dir/source/uint128.cpp.o
[  5%] Building CXX object dep/g3dlite/CMakeFiles/g3dlib.dir/source/UprightFrame.cpp.o
Linking CXX shared module libScriptPCH.cpp_dephelp.so
[  6%] Building CXX object dep/g3dlite/CMakeFiles/g3dlib.dir/source/Vector2.cpp.o
[  6%] Built target ScriptPCH.cpp_dephelp
[  6%] Building CXX object dep/g3dlite/CMakeFiles/g3dlib.dir/source/Vector3.cpp.o
[  6%] Building CXX object dep/g3dlite/CMakeFiles/g3dlib.dir/source/Vector4.cpp.o
Linking CXX static library libg3dlib.a
[  6%] Built target g3dlib
Linking CXX static library libgsoap.a
[  6%] Built target gsoap
make: ***  [all]Ошибка 2

- make -j 15
Да прибудет с нами Сила!
Сообщение # 5 написано 27.08.2017 в 21:38
dowland
Сержант
Цитата Gliptodont ()
[  0%] Building C object dep/jemalloc/CMakeFiles/jemalloc.dir/src/arena.c.oIn file included from /home/WoWSource434/dep/jemalloc/include/jemalloc/internal/jemalloc_internal.h:568:0,
                 from /home/WoWSource434/dep/jemalloc/src/arena.c:2:
/home/WoWSource434/dep/jemalloc/include/jemalloc/internal/util.h:88:49: error: expected ‘;’, ‘,’ or ‘)’ before ‘nptr’
 uintmax_t malloc_strtoumax(const char *restrict nptr
Тут я уже не знаю, я думаю лучше другое ядро попробовать
Сообщение # 6 написано 28.08.2017 в 09:14
Форум » TrinityCore » [TrinityCore] Help » Ошибка при компиляции(Ubuntu 14.04)
Страница 1 из 11
Поиск: